BDBM50343589 2-(5-(3-(4-(1,3-Dimethyl-2,6-dioxo-1,2,3,6-tetrahydropyrimidin-4-yl)-1,4-diazepan-1-yl)propyl)-10,11-dihydro-5Hdibenzo[b,f]azepin-3-yl)acetic acid::CHEMBL1774498
SMILES Cn1c(cc(=O)n(C)c1=O)N1CCCN(CCCN2c3ccccc3CCc3ccc(CC(O)=O)cc23)CC1
InChI Key InChIKey=BDOFZYNAHBHVET-UHFFFAOYSA-N
Data  1 IC50
  Tab Delimited (TSV)   2D SDfile   Computed 3D by Vconf -m prep SDfile
Find this compound or compounds like it in BindingDB:
Activity Spreadsheet -- Enzyme Inhibition Constant Data from BindingDB
Found 1 hit for monomerid = 50343589
TargetHistamine H1 receptor(Homo sapiens (Human))
Dainippon Sumitomo Pharma
Curated by ChEMBL
LigandPNGBDBM50343589(2-(5-(3-(4-(1,3-Dimethyl-2,6-dioxo-1,2,3,6-tetrahy...)
Affinity DataIC50:  54nM. Assay description: Displacement of [3H]pyrilamine from human histamine H1 receptor expressed in CHO-K1 cells after 60 mins by scintillation counting
In DepthDetails ArticlePubMed