BDBM50343646 2-((3S,6S)-4-oxo-3-((E)-3-(4-(phosphonooxy)phenyl)but-2-enamido)-1,2,3,4,6,7-hexahydroazepino[3,2,1-hi]indole-6-carboxamido)ethyl carbamate::CHEMBL1774969
SMILES CC(=CC(=O)N[C@H]1CCc2cccc3C[C@H](N(c23)C1=O)C(=O)NCCOC(N)=O)c1ccc(OP(O)(O)=O)cc1
InChI Key InChIKey=RWFRVPZUGDMQKR-SFTDATJTSA-N
Data  1 KI
  Tab Delimited (TSV)   2D SDfile   Computed 3D by Vconf -m prep SDfile
Find this compound or compounds like it in BindingDB:
Activity Spreadsheet -- Enzyme Inhibition Constant Data from BindingDB
Found 1 hit for monomerid = 50343646
TargetSignal transducer and activator of transcription 3(Homo sapiens (Human))
University Of Texas M. D. Anderson Cancer Center
Curated by ChEMBL
LigandPNGBDBM50343646(2-((3S,6S)-4-oxo-3-((E)-3-(4-(phosphonooxy)phenyl)...)
Affinity DataKi:  188nM. Assay description: Binding affinity to SH2 domain of Stat3 by fluorescence polarization assay
In DepthDetails ArticlePubMed