BDBM50343811 1-Carbamimidoyl-N-tetradecylcyclopropanecarboxamide Hydrochloride::CHEMBL1774553
SMILES CCCCCCCCCCCCCCNC(=O)C1(CC1)C(N)=N
InChI Key InChIKey=QFUQMINXKIRBCT-UHFFFAOYSA-N
Data  2 KI
  Tab Delimited (TSV)   2D SDfile   Computed 3D by Vconf -m prep SDfile
Find this compound or compounds like it in BindingDB:
Activity Spreadsheet -- Enzyme Inhibition Constant Data from BindingDB
Found 2 hits for monomerid = 50343811
TargetSphingosine kinase 1(Homo sapiens (Human))
University Of Virginia
Curated by ChEMBL
LigandPNGBDBM50343811(1-Carbamimidoyl-N-tetradecylcyclopropanecarboxamid...)
Affinity DataKi:  6.00E+3nM. Assay description: Inhibition of human recombinant SPHK1 expressed in baculovirus-infected Sf9 cells
In DepthDetails ArticlePubMed
TargetSphingosine kinase 2(Mus musculus (Mouse))
University Of Virginia
Curated by ChEMBL
LigandPNGBDBM50343811(1-Carbamimidoyl-N-tetradecylcyclopropanecarboxamid...)
Affinity DataKi:  7.50E+3nM. Assay description: Inhibition of mouse recombinant SPHK2 expressed in baculovirus-infected Sf9 cells
In DepthDetails ArticlePubMed