BDBM50343812 1-Carbamimidoyl-N-hexadecylcyclopropanecarboxamide Hydrochloride::CHEMBL1774554
SMILES CCCCCCCCCCCCCCCCNC(=O)C1(CC1)C(N)=N
InChI Key InChIKey=RNIGTTZZVOOFCZ-UHFFFAOYSA-N
Data  2 KI
  Tab Delimited (TSV)   2D SDfile   Computed 3D by Vconf -m prep SDfile
Find this compound or compounds like it in BindingDB:
Activity Spreadsheet -- Enzyme Inhibition Constant Data from BindingDB
Found 2 hits for monomerid = 50343812
TargetSphingosine kinase 1(Homo sapiens (Human))
University Of Virginia
Curated by ChEMBL
LigandPNGBDBM50343812(1-Carbamimidoyl-N-hexadecylcyclopropanecarboxamide...)
Affinity DataKi:  5.40E+3nM. Assay description: Inhibition of human recombinant SPHK1 expressed in baculovirus-infected Sf9 cells
In DepthDetails ArticlePubMed
TargetSphingosine kinase 2(Mus musculus (Mouse))
University Of Virginia
Curated by ChEMBL
LigandPNGBDBM50343812(1-Carbamimidoyl-N-hexadecylcyclopropanecarboxamide...)
Affinity DataKi: >1.00E+5nM. Assay description: Inhibition of mouse recombinant SPHK2 expressed in baculovirus-infected Sf9 cells
In DepthDetails ArticlePubMed