BDBM50343824 CHEMBL1774566::N-(1-Carbamimidoylcyclopropyl)-4-(7-(cyclopentylmethoxy)heptyl)benzamide Hydrochloride
SMILES NC(=N)C1(CC1)NC(=O)c1ccc(CCCCCCCOCC2CCCC2)cc1
InChI Key InChIKey=NMSNSRRVTXKDST-UHFFFAOYSA-N
Data  2 KI
  Tab Delimited (TSV)   2D SDfile   Computed 3D by Vconf -m prep SDfile
Find this compound or compounds like it in BindingDB:
Activity Spreadsheet -- Enzyme Inhibition Constant Data from BindingDB
Found 2 hits for monomerid = 50343824
TargetSphingosine kinase 1(Homo sapiens (Human))
University Of Virginia
Curated by ChEMBL
LigandPNGBDBM50343824(CHEMBL1774566 | N-(1-Carbamimidoylcyclopropyl)-4-(...)
Affinity DataKi:  170nM. Assay description: Inhibition of human recombinant SPHK1 expressed in baculovirus-infected Sf9 cells
In DepthDetails ArticlePubMed
TargetSphingosine kinase 2(Mus musculus (Mouse))
University Of Virginia
Curated by ChEMBL
LigandPNGBDBM50343824(CHEMBL1774566 | N-(1-Carbamimidoylcyclopropyl)-4-(...)
Affinity DataKi:  1.80E+4nM. Assay description: Inhibition of mouse recombinant SPHK2 expressed in baculovirus-infected Sf9 cells
In DepthDetails ArticlePubMed