BDBM50343834 (S)-1-(4-(4-(3-(2-Cyclohexylethyl)phenyl)-1H-imidazol-2-yl)benzoyl)pyrrolidine-2-carboximidamide Hydrochloride::CHEMBL1774586
SMILES NC(=N)[C@@H]1CCCN1C(=O)c1ccc(cc1)-c1nc(c[nH]1)-c1cccc(CCC2CCCCC2)c1
InChI Key InChIKey=KZRCYWLOQSQVRX-SANMLTNESA-N
Data  2 KI
  Tab Delimited (TSV)   2D SDfile   Computed 3D by Vconf -m prep SDfile
Find this compound or compounds like it in BindingDB:
Activity Spreadsheet -- Enzyme Inhibition Constant Data from BindingDB
Found 2 hits for monomerid = 50343834
TargetSphingosine kinase 1(Homo sapiens (Human))
University Of Virginia
Curated by ChEMBL
LigandPNGBDBM50343834((S)-1-(4-(4-(3-(2-Cyclohexylethyl)phenyl)-1H-imida...)
Affinity DataKi:  2.00E+3nM. Assay description: Inhibition of human recombinant SPHK1 expressed in baculovirus-infected Sf9 cells
In DepthDetails ArticlePubMed
TargetSphingosine kinase 2(Mus musculus (Mouse))
University Of Virginia
Curated by ChEMBL
LigandPNGBDBM50343834((S)-1-(4-(4-(3-(2-Cyclohexylethyl)phenyl)-1H-imida...)
Affinity DataKi:  2.00E+4nM. Assay description: Inhibition of mouse recombinant SPHK2 expressed in baculovirus-infected Sf9 cells
In DepthDetails ArticlePubMed