BDBM50343897 8-phenyl-Adenosine Mono Phosphate::CHEMBL1775011
SMILES Nc1ncnc2n([C@@H]3O[C@H](COP(O)(O)=O)[C@@H](O)[C@H]3O)c(nc12)-c1ccccc1
InChI Key InChIKey=DEPWNWWTVPHVGY-UBEDBUPSSA-N
Data  2 IC50
  Tab Delimited (TSV)   2D SDfile   Computed 3D by Vconf -m prep SDfile
Find this compound or compounds like it in BindingDB:
Activity Spreadsheet -- Enzyme Inhibition Constant Data from BindingDB
Found 2 hits for monomerid = 50343897
TargetNAD-dependent protein deacetylase sirtuin-2(Homo sapiens (Human))
University Of East Anglia
Curated by ChEMBL
LigandPNGBDBM50343897(8-phenyl-Adenosine Mono Phosphate | CHEMBL1775011)
Affinity DataIC50:  2.90E+4nM. Assay description: Inhibition of human recombinant N-terminally His6-tagged SIRT2 after 4 hrs by homogeneous fluorescent deacetylase assay
In DepthDetails ArticlePubMed
TargetNAD-dependent protein deacetylase sirtuin-1(Homo sapiens (Human))
University Of East Anglia
Curated by ChEMBL
LigandPNGBDBM50343897(8-phenyl-Adenosine Mono Phosphate | CHEMBL1775011)
Affinity DataIC50:  3.10E+4nM. Assay description: Inhibition of human recombinant GST-tagged SIRT1 after 4 hrs by homogeneous fluorescent deacetylase assay
In DepthDetails ArticlePubMed