BDBM50344282 (R)-quinuclidin-3-yl m-tolyl(2,4,5-trifluorobenzyl)carbamate::CHEMBL1779045
SMILES Cc1cccc(c1)N(Cc1cc(F)c(F)cc1F)C(=O)O[C@H]1CN2CCC1CC2
InChI Key InChIKey=WRQCVLFZYUVEBT-NRFANRHFSA-N
Data  3 IC50
  Tab Delimited (TSV)   2D SDfile   Computed 3D by Vconf -m prep SDfile
Find this compound or compounds like it in BindingDB:
Activity Spreadsheet -- Enzyme Inhibition Constant Data from BindingDB
Found 3 hits for monomerid = 50344282
TargetMuscarinic acetylcholine receptor M1(Homo sapiens (Human))
RhôNe-Poulenc Rorer
Curated by ChEMBL
LigandPNGBDBM50344282((R)-quinuclidin-3-yl m-tolyl(2,4,5-trifluorobenzyl...)
Affinity DataIC50:  1nM. Assay description: Displacement of [3H]NMS from human muscarinic M1 receptor expressed in CHO-K1 cells after 1 hr by scintillation counting
In DepthDetails ArticlePubMed
TargetMuscarinic acetylcholine receptor M2(Homo sapiens (Human))
RhôNe-Poulenc Rorer
Curated by ChEMBL
LigandPNGBDBM50344282((R)-quinuclidin-3-yl m-tolyl(2,4,5-trifluorobenzyl...)
Affinity DataIC50:  45.8nM. Assay description: Displacement of [3H]NMS from human muscarinic M2 receptor expressed in CHO-K1 cells after 1 hr by scintillation counting
In DepthDetails ArticlePubMed
TargetMuscarinic acetylcholine receptor M3(Homo sapiens (Human))
RhôNe-Poulenc Rorer
Curated by ChEMBL
LigandPNGBDBM50344282((R)-quinuclidin-3-yl m-tolyl(2,4,5-trifluorobenzyl...)
Affinity DataIC50:  1.40nM. Assay description: Displacement of [3H]NMS from human muscarinic M3 receptor expressed in CHO-K1 cells after 1 hr by scintillation counting
In DepthDetails ArticlePubMed