BDBM50344301 (R)-3-((3-fluorophenyl)(3,4,5-trifluorobenzyl)carbamoyloxy)-1-(2-phenoxyethyl)-1-azoniabicyclo[2.2.2]octane bromide::CHEMBL1779140
SMILES Fc1cccc(c1)N(Cc1cc(F)c(F)c(F)c1)C(=O)O[C@H]1C[N+]2(CCOc3ccccc3)CCC1CC2
InChI Key InChIKey=CNWBYOPCIWGBPG-AMSMYJGSSA-N
Data  3 IC50
  Tab Delimited (TSV)   2D SDfile   Computed 3D by Vconf -m prep SDfile
Find this compound or compounds like it in BindingDB:
Activity Spreadsheet -- Enzyme Inhibition Constant Data from BindingDB
Found 3 hits for monomerid = 50344301
TargetMuscarinic acetylcholine receptor M3(Homo sapiens (Human))
RhôNe-Poulenc Rorer
Curated by ChEMBL
LigandPNGBDBM50344301((R)-3-((3-fluorophenyl)(3,4,5-trifluorobenzyl)carb...)
Affinity DataIC50:  0.600nM. Assay description: Displacement of [3H]NMS from human muscarinic M3 receptor expressed in CHO-K1 cells after 1 hr by scintillation counting
In DepthDetails ArticlePubMed
TargetMuscarinic acetylcholine receptor M1(Homo sapiens (Human))
RhôNe-Poulenc Rorer
Curated by ChEMBL
LigandPNGBDBM50344301((R)-3-((3-fluorophenyl)(3,4,5-trifluorobenzyl)carb...)
Affinity DataIC50:  1.10nM. Assay description: Displacement of [3H]NMS from human muscarinic M1 receptor expressed in CHO-K1 cells after 1 hr by scintillation counting
In DepthDetails ArticlePubMed
TargetMuscarinic acetylcholine receptor M2(Homo sapiens (Human))
RhôNe-Poulenc Rorer
Curated by ChEMBL
LigandPNGBDBM50344301((R)-3-((3-fluorophenyl)(3,4,5-trifluorobenzyl)carb...)
Affinity DataIC50:  14.4nM. Assay description: Displacement of [3H]NMS from human muscarinic M2 receptor expressed in CHO-K1 cells after 1 hr by scintillation counting
In DepthDetails ArticlePubMed