BDBM50344573 CHEMBL1778450::N-(4-bromo-6-(2,2,2-trifluoroethylamino)pyridin-2-ylcarbamoyl)-5-(2-methoxyethyl)-4-methylthiophene-2-sulfonamide
SMILES COCCc1sc(cc1C)S(=O)(=O)NC(=O)Nc1cc(Br)cc(NCC(F)(F)F)n1
InChI Key InChIKey=YBESQNWQFZXQMW-UHFFFAOYSA-N
Data  2 IC50
  Tab Delimited (TSV)   2D SDfile   Computed 3D by Vconf -m prep SDfile
Find this compound or compounds like it in BindingDB:
Activity Spreadsheet -- Enzyme Inhibition Constant Data from BindingDB
Found 2 hits for monomerid = 50344573
TargetFructose-1,6-bisphosphatase 1(Mus musculus)
F. Hoffmann-La Roche
Curated by ChEMBL
LigandPNGBDBM50344573(CHEMBL1778450 | N-(4-bromo-6-(2,2,2-trifluoroethyl...)
Affinity DataIC50:  3.70E+3nM. Assay description: Inhibition of mouse liver fructose-1,6-bisphosphatase
In DepthDetails ArticlePubMed
TargetFructose-1,6-bisphosphatase 1(Homo sapiens (Human))
F. Hoffmann-La Roche
Curated by ChEMBL
LigandPNGBDBM50344573(CHEMBL1778450 | N-(4-bromo-6-(2,2,2-trifluoroethyl...)
Affinity DataIC50:  200nM. Assay description: Inhibition of human liver fructose-1,6-bisphosphatase
In DepthDetails ArticlePubMed