BDBM50344634 2-(4-methoxyphenyl)-2-oxoethyl 2-(4-acetylphenyl)-1,3-dioxoisoindoline-5-carboxylate::CHEMBL1779063
SMILES COc1ccc(cc1)C(=O)COC(=O)c1ccc2C(=O)N(C(=O)c2c1)c1ccc(cc1)C(C)=O
InChI Key InChIKey=PFWIYUONBMYSJS-UHFFFAOYSA-N
Data  1 IC50
  Tab Delimited (TSV)   2D SDfile   Computed 3D by Vconf -m prep SDfile
Find this compound or compounds like it in BindingDB:
Activity Spreadsheet -- Enzyme Inhibition Constant Data from BindingDB
Found 1 hit for monomerid = 50344634
TargetHepatocyte growth factor receptor(Homo sapiens (Human))
Chinese Academy Of Sciences
Curated by ChEMBL
LigandPNGBDBM50344634(2-(4-methoxyphenyl)-2-oxoethyl 2-(4-acetylphenyl)-...)
Affinity DataIC50:  3.70E+3nM. Assay description: Inhibition of purified c-Met using poly(glu,tyr) as substrate after 60 mins by ELISA
In DepthDetails ArticlePubMed