BDBM50344713 2'-(2-(3-acetylphenyl)pyrimidin-4-yl)-5',6'-dihydrospiro[piperidine-4,7'-pyrrolo[3,2-c]pyridin]-4'(1'H)-one::CHEMBL1779355
SMILES CC(=O)c1cccc(c1)-c1nccc(n1)-c1cc2c([nH]1)C1(CCNCC1)CNC2=O
InChI Key InChIKey=PNSAXRDZQXBQNB-UHFFFAOYSA-N
Data  1 EC50
  Tab Delimited (TSV)   2D SDfile   Computed 3D by Vconf -m prep SDfile
Find this compound or compounds like it in BindingDB:
Activity Spreadsheet -- Enzyme Inhibition Constant Data from BindingDB
Found 1 hit for monomerid = 50344713
TargetMAP kinase-activated protein kinase 2(Homo sapiens (Human))
Merck Research Laboratories
Curated by ChEMBL
LigandPNGBDBM50344713(2'-(2-(3-acetylphenyl)pyrimidin-4-yl)-5',6'-dihydr...)
Affinity DataEC50:  11nM. Assay description: Inhibition of MK2 pretreated for 30 mins before fluorescein labeled substrate peptide addition measured after 2 hrs by IMAP assay
In DepthDetails ArticlePubMed