BDBM50344878 5-(4-chlorophenyl)-1-phenyl-3-(trifluoromethyl)-1H-pyrazole-4-carbaldehyde::CHEMBL1780083
SMILES FC(F)(F)c1nn(c(c1C=O)-c1ccc(Cl)cc1)-c1ccccc1
InChI Key InChIKey=YEBAWYVHPNUTJE-UHFFFAOYSA-N
Data  3 IC50
  Tab Delimited (TSV)   2D SDfile   Computed 3D by Vconf -m prep SDfile
Find this compound or compounds like it in BindingDB:
Activity Spreadsheet -- Enzyme Inhibition Constant Data from BindingDB
Found 3 hits for monomerid = 50344878
TargetProstaglandin G/H synthase 2(Ovis aries (Sheep))
University Of Mansoura
Curated by ChEMBL
LigandPNGBDBM50344878(5-(4-chlorophenyl)-1-phenyl-3-(trifluoromethyl)-1H...)
Affinity DataIC50:  550nM. Assay description: Inhibition of ovine COX2 assessed as PGF2alpha production from PGH2 after 5 mins by enzyme immunoassay
In DepthDetails ArticlePubMed
TargetProstaglandin G/H synthase 2(Ovis aries (Sheep))
University Of Mansoura
Curated by ChEMBL
LigandPNGBDBM50344878(5-(4-chlorophenyl)-1-phenyl-3-(trifluoromethyl)-1H...)
Affinity DataIC50:  550nM. Assay description: Inhibition of ovine COX2 by enzyme immuno assay
In DepthDetails ArticlePubMed
TargetProstaglandin G/H synthase 1(Ovis aries (Sheep))
University Of Mansoura
Curated by ChEMBL
LigandPNGBDBM50344878(5-(4-chlorophenyl)-1-phenyl-3-(trifluoromethyl)-1H...)
Affinity DataIC50: >5.00E+4nM. Assay description: Inhibition of ovine COX1 assessed as PGF2alpha production from PGH2 after 5 mins by enzyme immunoassay
In DepthDetails ArticlePubMed