BDBM50344897 CHEMBL1076681::Sodium Borate::Sodium tetraborate(VII)::sodium tetraborate
SMILES O=BO[B-](=O)O[B-](=O)OB=O
InChI Key InChIKey=QIHRQKFHRODZNP-UHFFFAOYSA-N
Data  10 KI
  Tab Delimited (TSV)   2D SDfile   Computed 3D by Vconf -m prep SDfile
Find this compound or compounds like it in BindingDB:
Activity Spreadsheet -- Enzyme Inhibition Constant Data from BindingDB
Found 10 hits for monomerid = 50344897
TargetCarbonic anhydrase 1(Homo sapiens (Human))
Universit£
Curated by ChEMBL
LigandPNGBDBM50344897(CHEMBL1076681 | Sodium Borate | Sodium tetraborate...)
Affinity DataKi:  6.40E+5nMpH: 8.3Assay Description:Inhibition of recombinant human carbonic anhydrase 1 after 15 mins by stopped flow CO2 hydration assay at pH 8.3
In DepthDetails ArticlePubMed
TargetCarbonic anhydrase 1(Homo sapiens (Human))
Universit£
Curated by ChEMBL
LigandPNGBDBM50344897(CHEMBL1076681 | Sodium Borate | Sodium tetraborate...)
Affinity DataKi:  6.40E+5nM. Assay description: Inhibition of human cytosolic carbonic anhydrase 1 preincubated for 15 mins by stopped flow CO2 hydration assay
In DepthDetails ArticlePubMed
TargetCarbonic anhydrase 1(Homo sapiens (Human))
Universit£
Curated by ChEMBL
LigandPNGBDBM50344897(CHEMBL1076681 | Sodium Borate | Sodium tetraborate...)
Affinity DataKi:  6.40E+5nM. Assay description: Inhibition of human carbonic anhydrase 1 preincubated for 15 mins by stopped flow CO2 hydration assay
In DepthDetails ArticlePubMed
TargetCarbonic anhydrase 1(Homo sapiens (Human))
Universit£
Curated by ChEMBL
LigandPNGBDBM50344897(CHEMBL1076681 | Sodium Borate | Sodium tetraborate...)
Affinity DataKi:  6.40E+5nM. Assay description: Inhibition of human recombinant carbonic anhydrase 1 by stopped flow CO2 hydration assay
In DepthDetails ArticlePubMed
TargetCarbonic anhydrase 2(Homo sapiens (Human))
Universit£
Curated by ChEMBL
LigandPNGBDBM50344897(CHEMBL1076681 | Sodium Borate | Sodium tetraborate...)
Affinity DataKi:  9.50E+5nM. Assay description: Inhibition of human cytosolic carbonic anhydrase 2 preincubated for 15 mins by stopped flow CO2 hydration assay
In DepthDetails ArticlePubMed
TargetCarbonic anhydrase 2(Homo sapiens (Human))
Universit£
Curated by ChEMBL
LigandPNGBDBM50344897(CHEMBL1076681 | Sodium Borate | Sodium tetraborate...)
Affinity DataKi:  9.50E+5nM. Assay description: Inhibition of human cytosolic carbonic anhydrase-2 preincubated for 15 mins by stopped flow CO2 hydration assay
In DepthDetails ArticlePubMed
TargetCarbonic anhydrase 2(Homo sapiens (Human))
Universit£
Curated by ChEMBL
LigandPNGBDBM50344897(CHEMBL1076681 | Sodium Borate | Sodium tetraborate...)
Affinity DataKi:  9.50E+5nM. Assay description: Inhibition of human recombinant carbonic anhydrase 2 by stopped flow CO2 hydration assay
In DepthDetails ArticlePubMed
TargetCarbonic anhydrase 2(Homo sapiens (Human))
Universit£
Curated by ChEMBL
LigandPNGBDBM50344897(CHEMBL1076681 | Sodium Borate | Sodium tetraborate...)
Affinity DataKi:  9.50E+5nM. Assay description: Inhibition of human carbonic anhydrase 2 preincubated for 15 mins by stopped flow CO2 hydration assay
In DepthDetails ArticlePubMed
TargetCarbonic anhydrase 2(Homo sapiens (Human))
Universit£
Curated by ChEMBL
LigandPNGBDBM50344897(CHEMBL1076681 | Sodium Borate | Sodium tetraborate...)
Affinity DataKi:  9.50E+5nMpH: 8.3Assay Description:Inhibition of recombinant human carbonic anhydrase 2 after 15 mins by stopped flow CO2 hydration assay at pH 8.3
In DepthDetails ArticlePubMed
TargetCarbonic anhydrase(Astrosclera willeyana)
Slovak Academy Of Sciences
Curated by ChEMBL
LigandPNGBDBM50344897(CHEMBL1076681 | Sodium Borate | Sodium tetraborate...)
Affinity DataKi:  2.19E+7nM. Assay description: Inhibition of Astrosclera willeyana recombinant GST-tagged astrosclerin 3 expressed in Escherichia coli BL21-DE3-RIPL cells preincubated for 15 mins ...
In DepthDetails ArticlePubMed