BDBM50345121 2-(2-methyl-[1,2,4]triazolo[1,5-c]quinazolin-5-ylthio)acetonitrile::CHEMBL1779267
SMILES Cc1nc2c3ccccc3nc(SCC#N)n2n1
InChI Key InChIKey=FEYUFPIHTRMMSZ-UHFFFAOYSA-N
Data  1 IC50
  Tab Delimited (TSV)   2D SDfile   Computed 3D by Vconf -m prep SDfile
Find this compound or compounds like it in BindingDB:
Activity Spreadsheet -- Enzyme Inhibition Constant Data from BindingDB
Found 1 hit for monomerid = 50345121
TargetcAMP and cAMP-inhibited cGMP 3',5'-cyclic phosphodiesterase 10A(Homo sapiens (Human))
H. Lundbeck
Curated by ChEMBL
LigandPNGBDBM50345121(2-(2-methyl-[1,2,4]triazolo[1,5-c]quinazolin-5-ylt...)
Affinity DataIC50:  310nM. Assay description: Inhibition of PDE10A
In DepthDetails ArticlePubMed