BDBM50345234 5-(trifluoromethoxy)benzofuran-2-carboxylic acid::CHEMBL1782506
SMILES OC(=O)c1cc2cc(OC(F)(F)F)ccc2o1
InChI Key InChIKey=FFRXHZJRPILGIB-UHFFFAOYSA-N
Data  1 IC50
  Tab Delimited (TSV)   2D SDfile   Computed 3D by Vconf -m prep SDfile
Find this compound or compounds like it in BindingDB:
Activity Spreadsheet -- Enzyme Inhibition Constant Data from BindingDB
Found 1 hit for monomerid = 50345234
TargetSerine/threonine-protein kinase pim-1(Homo sapiens (Human))
Genzyme
Curated by ChEMBL
LigandPNGBDBM50345234(5-(trifluoromethoxy)benzofuran-2-carboxylic acid |...)
Affinity DataIC50:  6.10E+3nM. Assay description: Inhibition of human Pim1 using 5-FAM-RSRHSSYPAGT-CONH2 as substrate after 45 mins by off-chip mobility shift method
In DepthDetails ArticlePubMed