BDBM50345634 (2S)-2-acetamido-3-((2S)-2-((2S,3R)-1-(1-amino-3-(naphthalen-1-yl)-1-oxopropan-2-ylamino)-3-hydroxy-1-oxobutan-2-ylcarbamoyl)pyrrolidin-1-yl)-3-oxopropyl dihydrogen phosphate::CHEMBL1784778
SMILES C[C@@H](O)[C@H](NC(=O)[C@@H]1CCCN1C(=O)[C@H](COP(O)(O)=O)NC(C)=O)C(=O)NC(Cc1cccc2ccccc12)C(N)=O
InChI Key InChIKey=YZPWVLRUFJPKLM-GMPPNZPMSA-N
Data  1 IC50
  Tab Delimited (TSV)   2D SDfile   Computed 3D by Vconf -m prep SDfile
Find this compound or compounds like it in BindingDB:
Activity Spreadsheet -- Enzyme Inhibition Constant Data from BindingDB
Found 1 hit for monomerid = 50345634
TargetBreast cancer type 1 susceptibility protein(Homo sapiens (Human))
University Of Nebraska Medical Center
Curated by ChEMBL
LigandPNGBDBM50345634((2S)-2-acetamido-3-((2S)-2-((2S,3R)-1-(1-amino-3-(...)
Affinity DataIC50:  1.72E+5nM. Assay description: Inhibition of BRCA1 by fluorescence polarization assay
In DepthDetails ArticlePubMed