BDBM50345781 2-(3,4-difluorophenoxy)-4-(4-(4-fluorophenyl)-1-(piperidin-4-yl)-1H-imidazol-5-yl)pyrimidine::CHEMBL1785004
SMILES Fc1ccc(cc1)-c1ncn(C2CCNCC2)c1-c1ccnc(Oc2ccc(F)c(F)c2)n1
InChI Key InChIKey=HIPGWLDSFHGAAY-UHFFFAOYSA-N
Data  1 IC50
  Tab Delimited (TSV)   2D SDfile   Computed 3D by Vconf -m prep SDfile
Find this compound or compounds like it in BindingDB:
Activity Spreadsheet -- Enzyme Inhibition Constant Data from BindingDB
Found 1 hit for monomerid = 50345781
TargetMitogen-activated protein kinase 14(Homo sapiens (Human))
University College Of Pharmaceutical Sciences
Curated by ChEMBL
LigandPNGBDBM50345781(2-(3,4-difluorophenoxy)-4-(4-(4-fluorophenyl)-1-(p...)
Affinity DataIC50:  209nM. Assay description: Inhibition of p38alpha
In DepthDetails ArticlePubMed