BDBM50346007 (S)-3-cyclohexyl-2-(4-(isopropylsulfonyl)-2-oxopyridin-1(2H)-yl)-N-(5-methylpyridin-2-yl)propanamide::CHEMBL1783747
SMILES CC(C)S(=O)(=O)c1ccn([C@@H](CC2CCCCC2)C(=O)Nc2ccc(C)cn2)c(=O)c1
InChI Key InChIKey=CMVJPDGJFABMKS-FQEVSTJZSA-N
Data  1 EC50
  Tab Delimited (TSV)   2D SDfile   Computed 3D by Vconf -m prep SDfile
Find this compound or compounds like it in BindingDB:
Activity Spreadsheet -- Enzyme Inhibition Constant Data from BindingDB
Found 1 hit for monomerid = 50346007
TargetHexokinase-4(Homo sapiens (Human))
Pfizer
Curated by ChEMBL
LigandPNGBDBM50346007((S)-3-cyclohexyl-2-(4-(isopropylsulfonyl)-2-oxopyr...)
Affinity DataEC50:  240nM. Assay description: Activation of human recombinant glucokinase using 6.5 mM glucose by spectrophotometry
In DepthDetails ArticlePubMed