BDBM50346020 (2R)-3-Cyclopentyl-2-(4-methanesulfonylphenyl)-N-thiazol-2-yl-propionamide::(R)-3-cyclopentyl-2-(4-(methylsulfonyl)phenyl)-N-(thiazol-2-yl)propanamide::CHEMBL1096435::Ro-0281675
SMILES CS(=O)(=O)c1ccc(cc1)[C@@H](CC1CCCC1)C(=O)Nc1nccs1
InChI Key InChIKey=NEQSWPCDHDQINX-MRXNPFEDSA-N
Data  1 Kd  2 EC50
PDB links: 1 PDB ID matches this monomer.
  Tab Delimited (TSV)   2D SDfile   Computed 3D by Vconf -m prep SDfile
Find this compound or compounds like it in BindingDB:
Activity Spreadsheet -- Enzyme Inhibition Constant Data from BindingDB
Found 3 hits for monomerid = 50346020
TargetHexokinase-4(Homo sapiens (Human))
Florida State University
Curated by ChEMBL
LigandPNGBDBM50346020((2R)-3-Cyclopentyl-2-(4-methanesulfonylphenyl)-N-t...)
Affinity DataKd:  500nM. Assay description: Binding affinity to recombinant wild-type human pancreatic glucokinase expressed in Escherichia coli K-12 by isothermal titration calorimetry in pres...
TargetHexokinase-4(Homo sapiens (Human))
Florida State University
Curated by ChEMBL
LigandPNGBDBM50346020((2R)-3-Cyclopentyl-2-(4-methanesulfonylphenyl)-N-t...)
Affinity DataEC50:  500nM. Assay description: Activation of glucokinase (unknown origin)
TargetHexokinase-4(Homo sapiens (Human))
Florida State University
Curated by ChEMBL
LigandPNGBDBM50346020((2R)-3-Cyclopentyl-2-(4-methanesulfonylphenyl)-N-t...)
Affinity DataEC50:  690nM. Assay description: Activation of human recombinant glucokinase using 6.5 mM glucose by spectrophotometry