BDBM50346173 2-(pyrimidin-5-ylmethyl)quinuclidine bis(2,2,2-trifluoroacetate)::CHEMBL1783882
SMILES C(C1CC2CCN1CC2)c1cncnc1
InChI Key InChIKey=UPYOGPXBFMUAMJ-UHFFFAOYSA-N
Data  1 KI
  Tab Delimited (TSV)   2D SDfile   Computed 3D by Vconf -m prep SDfile
Find this compound or compounds like it in BindingDB:
Activity Spreadsheet -- Enzyme Inhibition Constant Data from BindingDB
Found 1 hit for monomerid = 50346173
TargetNeuronal acetylcholine receptor subunit alpha-7(Mus musculus)
Targacept
Curated by ChEMBL
LigandPNGBDBM50346173(2-(pyrimidin-5-ylmethyl)quinuclidine bis(2,2,2-tri...)
Affinity DataKi:  2.59E+3nM. Assay description: Displacement of [125I]alpha-bungarotoxin from alpha7 nAChR in C57BL/6J mouse hippocampal membrane
In DepthDetails ArticlePubMed