BDBM50346318 (S)-3-(3-fluoro-4-(4-(1,4,5,6-tetrahydropyrimidin-2-ylamino)piperidin-1-yl)benzamido)-2-(phenylsulfonamido)propanoic acid::CHEMBL599119
SMILES [#8]-[#6](=O)-[#6@H](-[#6]-[#7]-[#6](=O)-c1ccc(-[#7]-2-[#6]-[#6]-[#6](-[#6]-[#6]-2)\[#7]=[#6]-2\[#7]-[#6]-[#6]-[#6]-[#7]-2)c(F)c1)-[#7]S(=O)(=O)c1ccccc1
InChI Key InChIKey=BGLLQJHWAUGNSA-NRFANRHFSA-N
Data  3 IC50
  Tab Delimited (TSV)   2D SDfile   Computed 3D by Vconf -m prep SDfile
Find this compound or compounds like it in BindingDB:
Activity Spreadsheet -- Enzyme Inhibition Constant Data from BindingDB
Found 3 hits for monomerid = 50346318
TargetIntegrin alpha-V/beta-3(Homo sapiens (Human))
The University Of Tokyo
Curated by ChEMBL
LigandPNGBDBM50346318((S)-3-(3-fluoro-4-(4-(1,4,5,6-tetrahydropyrimidin-...)
Affinity DataIC50:  48nM. Assay description: Antagonist activity at alphavbeta3 integrin receptor human VSMC assessed as inhibition of vitronectin-induced cell adhesion
In DepthDetails ArticlePubMed
TargetIntegrin alpha-V/beta-3(Homo sapiens (Human))
The University Of Tokyo
Curated by ChEMBL
LigandPNGBDBM50346318((S)-3-(3-fluoro-4-(4-(1,4,5,6-tetrahydropyrimidin-...)
Affinity DataIC50:  0.360nM. Assay description: Antagonist activity at alphavbeta3 integrin receptor
In DepthDetails ArticlePubMed
TargetIntegrin alpha-IIb/beta-3(Homo sapiens (Human))
The University Of Tokyo
Curated by ChEMBL
LigandPNGBDBM50346318((S)-3-(3-fluoro-4-(4-(1,4,5,6-tetrahydropyrimidin-...)
Affinity DataIC50:  0.210nM. Assay description: Antagonist activity at alpha2bbeta3 integrin receptor
In DepthDetails ArticlePubMed