BDBM50346532 (R)-pyrrolidine-2-carboximidamide::CHEMBL1783097
SMILES NC(=N)[C@H]1CCCN1
InChI Key InChIKey=SYERHLYFHUKCKP-SCSAIBSYSA-N
Data  3 IC50  1 Kd
  Tab Delimited (TSV)   2D SDfile   Computed 3D by Vconf -m prep SDfile
Find this compound or compounds like it in BindingDB:
Activity Spreadsheet -- Enzyme Inhibition Constant Data from BindingDB
Found 4 hits for monomerid = 50346532
TargetNitric oxide synthase, inducible(Homo sapiens (Human))
Glaxosmithkline
Curated by ChEMBL
LigandPNGBDBM50346532((R)-pyrrolidine-2-carboximidamide | CHEMBL1783097)
Affinity DataKd:  630nM. Assay description: Binding affinity to human recombinant iNOS delta 65 residue
In DepthDetails ArticlePubMed
TargetNitric oxide synthase, brain(Homo sapiens (Human))
Glaxosmithkline
Curated by ChEMBL
LigandPNGBDBM50346532((R)-pyrrolidine-2-carboximidamide | CHEMBL1783097)
Affinity DataIC50:  1.40E+4nM. Assay description: Inhibition of human recombinant nNOS by microtiter plate assay
In DepthDetails ArticlePubMed
TargetNitric oxide synthase, endothelial(Homo sapiens (Human))
Glaxosmithkline
Curated by ChEMBL
LigandPNGBDBM50346532((R)-pyrrolidine-2-carboximidamide | CHEMBL1783097)
Affinity DataIC50:  1.50E+4nM. Assay description: Inhibition of human recombinant eNOS by microtiter plate assay
In DepthDetails ArticlePubMed
TargetNitric oxide synthase, inducible(Homo sapiens (Human))
Glaxosmithkline
Curated by ChEMBL
LigandPNGBDBM50346532((R)-pyrrolidine-2-carboximidamide | CHEMBL1783097)
Affinity DataIC50:  120nM. Assay description: Inhibition of human recombinant iNOS by microtiter plate assay
In DepthDetails ArticlePubMed