BDBM50346713 CHEMBL1797447
SMILES ClCC(=O)Nc1ccc(cc1)S(=O)(=O)c1ccc(NC(=O)CCl)cc1
InChI Key InChIKey=SHRCVZJKZJGIHQ-UHFFFAOYSA-N
Data  1 IC50
  Tab Delimited (TSV)   2D SDfile   Computed 3D by Vconf -m prep SDfile
Find this compound or compounds like it in BindingDB:
Activity Spreadsheet -- Enzyme Inhibition Constant Data from BindingDB
Found 1 hit for monomerid = 50346713
TargetProtein arginine N-methyltransferase 1 [11-371](Homo sapiens (Human))
Albert-Ludwigs-University Of Freiburg
Curated by ChEMBL
LigandPNGBDBM50346713(CHEMBL1797447)
Affinity DataIC50:  1.50E+3nM. Assay description: Inhibition of human recombinant PRMT1-mediated arginine methylation using nonhistone protein Npl3 substrate by ELISA
In DepthDetails ArticlePubMed