BDBM50346790 CHEMBL1795439
SMILES COc1cccc(c1)-c1cc2cc3CC(Oc3cc2o1)C(C)(C)O
InChI Key InChIKey=HXFVJRIJLMSFHH-UHFFFAOYSA-N
Data  1 IC50
  Tab Delimited (TSV)   2D SDfile   Computed 3D by Vconf -m prep SDfile
Find this compound or compounds like it in BindingDB:
Activity Spreadsheet -- Enzyme Inhibition Constant Data from BindingDB
Found 1 hit for monomerid = 50346790
TargetHypoxia-inducible factor 1-alpha(Homo sapiens (Human))
Dongguk University-Seoul
Curated by ChEMBL
LigandPNGBDBM50346790(CHEMBL1795439)
Affinity DataIC50:  7nM. Assay description: Inhibition of hypoxia-induced HIF1alpha activation in human Hep3B cells after 16 hrs by HRE-luciferase reporter assay
In DepthDetails ArticlePubMed