BDBM50346866 CHEMBL1797643::S1201
SMILES NC1CC1c1cccc(F)c1OCc1ccccc1
InChI Key InChIKey=UQQFXBLESPXLHL-UHFFFAOYSA-N
Data  3 KI  2 IC50
  Tab Delimited (TSV)   2D SDfile   Computed 3D by Vconf -m prep SDfile
Find this compound or compounds like it in BindingDB:
Activity Spreadsheet -- Enzyme Inhibition Constant Data from BindingDB
Found 5 hits for monomerid = 50346866
TargetLysine-specific histone demethylase 1A(Homo sapiens (Human))
Key Laboratory Of Henan Provinc
Curated by ChEMBL
LigandPNGBDBM50346866(CHEMBL1797643 | S1201)
Affinity DataKi:  2.40E+3nM. Assay description: Inhibition of hexahistidine-tagged human LSD1 (172 to 833 residues) expressed in Escherichia coli Rosetta (DE3) cells using H3K4me2 peptide as substr...
In DepthDetails ArticlePubMed
TargetAmine oxidase [flavin-containing] B(Homo sapiens (Human))
Key Laboratory Of Henan Provinc
Curated by ChEMBL
LigandPNGBDBM50346866(CHEMBL1797643 | S1201)
Affinity DataKi:  4.20E+4nM. Assay description: Inhibition of human MAO-B expressed in expressed in baculovirus infected BTI insect cells using tyramine as substrate by peroxidase-coupled method
In DepthDetails ArticlePubMed
TargetAmine oxidase [flavin-containing] A(Homo sapiens (Human))
Key Laboratory Of Henan Provinc
Curated by ChEMBL
LigandPNGBDBM50346866(CHEMBL1797643 | S1201)
Affinity DataKi:  6.40E+4nM. Assay description: Inhibition of human MAO-A expressed in expressed in baculovirus infected BTI insect cells using tyramine as substrate by peroxidase-coupled method
In DepthDetails ArticlePubMed
TargetLysine-specific histone demethylase 1A(Homo sapiens (Human))
Key Laboratory Of Henan Provinc
Curated by ChEMBL
LigandPNGBDBM50346866(CHEMBL1797643 | S1201)
Affinity DataIC50:  8.10E+3nM. Assay description: The kinetic inhibition parameters of LSD1 demethylase inhibition were obtained using the peroxidase-coupled reaction method.
In DepthDetails ArticlePubMed
TargetLysine-specific histone demethylase 1A(Homo sapiens (Human))
Key Laboratory Of Henan Provinc
Curated by ChEMBL
LigandPNGBDBM50346866(CHEMBL1797643 | S1201)
Affinity DataIC50:  9.00E+3nM. Assay description: Inhibition of LSD1
In DepthDetails ArticlePubMed