BDBM50346962 CHEMBL1795876
SMILES CNC(=O)c1ccc(cc1)-c1ccc(cc1C(F)(F)F)-n1c2c(ccc1=O)cnc1ccc(cc21)-c1cnc2ccccc2c1
InChI Key InChIKey=MHSSNLFVZXULNC-UHFFFAOYSA-N
Data  1 EC50
  Tab Delimited (TSV)   2D SDfile   Computed 3D by Vconf -m prep SDfile
Find this compound or compounds like it in BindingDB:
Activity Spreadsheet -- Enzyme Inhibition Constant Data from BindingDB
Found 1 hit for monomerid = 50346962
TargetSerine/threonine-protein kinase mTOR(Mus musculus (Mouse))
Dana-Farber Cancer Institute
Curated by ChEMBL
LigandPNGBDBM50346962(CHEMBL1795876)
Affinity DataEC50:  15nM. Assay description: Inhibition of mTOR-dependent S6K phosphorylation at T389 residue in MEF cells
In DepthDetails ArticlePubMed