BDBM50347075 CHEMBL1796262
SMILES COCCN1CCc2ccc(Nc3ncc(Cl)c(N[C@@H]4CCC[C@@H](C4)NS(C)(=O)=O)n3)cc2CC1
InChI Key InChIKey=PXSLVHRVLNRHCF-CTNGQTDRSA-N
Data  1 IC50
  Tab Delimited (TSV)   2D SDfile   Computed 3D by Vconf -m prep SDfile
Find this compound or compounds like it in BindingDB:
Activity Spreadsheet -- Enzyme Inhibition Constant Data from BindingDB
Found 1 hit for monomerid = 50347075
TargetALK tyrosine kinase receptor(Homo sapiens (Human))
Cephalon
Curated by ChEMBL
LigandPNGBDBM50347075(CHEMBL1796262)
Affinity DataIC50: >3.00E+3nM. Assay description: Inhibition of ALK
In DepthDetails ArticlePubMed