BDBM50347275 CHEMBL1796125
SMILES CN(CCCNC(=O)c1ccc2c(c1)N(Cc1ccc(Cl)cc1)C(=O)c1ccccc1S2(=O)=O)C1CCCCC1
InChI Key InChIKey=PUXUIXQOXURORP-UHFFFAOYSA-N
Data  1 IC50
  Tab Delimited (TSV)   2D SDfile   Computed 3D by Vconf -m prep SDfile
Find this compound or compounds like it in BindingDB:
Activity Spreadsheet -- Enzyme Inhibition Constant Data from BindingDB
Found 1 hit for monomerid = 50347275
TargetL-cysteine:1D-myo-inositol 2-amino-2-deoxy-alpha-D-glucopyranoside ligase(Mycobacterium tuberculosis)
University Of California
Curated by ChEMBL
LigandPNGBDBM50347275(CHEMBL1796125)
Affinity DataIC50:  3.30E+5nM. Assay description: Inhibition of Mycobacterium tuberculosis recombinant MshC assessed as production of Cys-GlcN-Ins from cysteine by HPLC based fluorescence assay
In DepthDetails ArticlePubMed