BDBM50347314 CHEMBL1796836
SMILES CCCCCc1ccc(cc1)S(=O)(=O)NCCc1c(n[nH]c1-c1cccc(OC)c1)-c1ccccc1
InChI Key InChIKey=IMXODAOFWBSHSV-UHFFFAOYSA-N
Data  2 IC50
  Tab Delimited (TSV)   2D SDfile   Computed 3D by Vconf -m prep SDfile
Find this compound or compounds like it in BindingDB:
Activity Spreadsheet -- Enzyme Inhibition Constant Data from BindingDB
Found 2 hits for monomerid = 50347314
TargetPolyunsaturated fatty acid lipoxygenase ALOX15(Oryctolagus cuniculus (rabbit))
Bristol-Myers Squibb Research And Development
Curated by ChEMBL
LigandPNGBDBM50347314(CHEMBL1796836)
Affinity DataIC50:  524nM. Assay description: Inhibition of rabbit 15-LO using arachidonic acid by standard colorimetric assay
In DepthDetails ArticlePubMed
TargetPolyunsaturated fatty acid lipoxygenase ALOX15(Oryctolagus cuniculus (rabbit))
Bristol-Myers Squibb Research And Development
Curated by ChEMBL
LigandPNGBDBM50347314(CHEMBL1796836)
Affinity DataIC50:  68nM. Assay description: Inhibition of rabbit 15-LO using linoleic acid by standard colorimetric assay
In DepthDetails ArticlePubMed