BDBM50347393 CHEMBL1801565
SMILES Cn1cnc2ccc(CN(CC#C)c3ccc(cc3)C(=O)NCc3cccnc3)cc2c1=O
InChI Key InChIKey=SHWLQJPHVYVDRQ-UHFFFAOYSA-N
Data  1 IC50
  Tab Delimited (TSV)   2D SDfile   Computed 3D by Vconf -m prep SDfile
Find this compound or compounds like it in BindingDB:
Activity Spreadsheet -- Enzyme Inhibition Constant Data from BindingDB
Found 1 hit for monomerid = 50347393
TargetNicotinamide phosphoribosyltransferase(Homo sapiens (Human))
Myrexis
Curated by ChEMBL
LigandPNGBDBM50347393(CHEMBL1801565)
Affinity DataIC50:  12nM. Assay description: Inhibition of nicotinamide phosphoribosyltransferase-catalyzed conversion of nicotinamide to nicotinamide mononucleotide
In DepthDetails ArticlePubMed