BDBM50347395 CHEMBL1801567
SMILES [#6]\[#6](-[#6])=[#6]\[#6]-[#7](-[#6]-c1cc2c(cc1Cl)ncn(-[#6])c2=O)-c1ccc(cc1)-[#6](=O)-[#7]-[#6]-c1cccnc1
InChI Key InChIKey=LFIIUCLVTYUBMB-UHFFFAOYSA-N
Data  1 IC50
  Tab Delimited (TSV)   2D SDfile   Computed 3D by Vconf -m prep SDfile
Find this compound or compounds like it in BindingDB:
Activity Spreadsheet -- Enzyme Inhibition Constant Data from BindingDB
Found 1 hit for monomerid = 50347395
TargetNicotinamide phosphoribosyltransferase(Homo sapiens (Human))
Myrexis
Curated by ChEMBL
LigandPNGBDBM50347395(CHEMBL1801567)
Affinity DataIC50:  2.60nM. Assay description: Inhibition of nicotinamide phosphoribosyltransferase-catalyzed conversion of nicotinamide to nicotinamide mononucleotide
In DepthDetails ArticlePubMed