BDBM50347426 CHEMBL1801935
SMILES [#6]\[#6](-[#6])=[#6]\[#6]-[#7](-[#6]-c1cc2c(cc1Cl)nc(-[#6])n(-[#6])c2=O)-c1ccc(cc1)-[#6](=O)-[#7]-[#6]-c1cccnc1
InChI Key InChIKey=CZBNVFHQYYZDHR-UHFFFAOYSA-N
Data  1 IC50
  Tab Delimited (TSV)   2D SDfile   Computed 3D by Vconf -m prep SDfile
Find this compound or compounds like it in BindingDB:
Activity Spreadsheet -- Enzyme Inhibition Constant Data from BindingDB
Found 1 hit for monomerid = 50347426
TargetNicotinamide phosphoribosyltransferase(Homo sapiens (Human))
Myrexis
Curated by ChEMBL
LigandPNGBDBM50347426(CHEMBL1801935)
Affinity DataIC50:  11nM. Assay description: Inhibition of nicotinamide phosphoribosyltransferase-catalyzed conversion of nicotinamide to nicotinamide mononucleotide
In DepthDetails ArticlePubMed