BDBM50347709 CHEMBL1802457
SMILES Cc1ccccc1CN1C\C(=C/c2ccc(O)c(Br)c2)C(=O)\C(C1)=C\c1ccc(O)c(Br)c1
InChI Key InChIKey=ACMXKKCTUDISBF-OIEABDAFSA-N
Data  3 IC50
  Tab Delimited (TSV)   2D SDfile   Computed 3D by Vconf -m prep SDfile
Find this compound or compounds like it in BindingDB:
Activity Spreadsheet -- Enzyme Inhibition Constant Data from BindingDB
Found 3 hits for monomerid = 50347709
TargetHistone-arginine methyltransferase CARM1(Homo sapiens (Human))
The University Of Texas M.D. Anderson Cancer Center
Curated by ChEMBL
LigandPNGBDBM50347709(CHEMBL1802457)
Affinity DataIC50:  1.03E+4nM. Assay description: Inhibition of CARM1-mediated methylation of PABP1 after 90 mins by scintillation counting in presence of S-adenosyl-l-[methyl-3H]methionine
In DepthDetails ArticlePubMed
TargetHistone-lysine N-methyltransferase SETD7(Homo sapiens (Human))
The University Of Texas M.D. Anderson Cancer Center
Curated by ChEMBL
LigandPNGBDBM50347709(CHEMBL1802457)
Affinity DataIC50: >6.67E+5nM. Assay description: Inhibition of SET7-mediated methylation of histone H3 after 90 mins by scintillation counting in presence of S-adenosyl-l-[methyl-3H]methionine
In DepthDetails ArticlePubMed
TargetProtein arginine N-methyltransferase 1 [11-371](Homo sapiens (Human))
The University Of Texas M.D. Anderson Cancer Center
Curated by ChEMBL
LigandPNGBDBM50347709(CHEMBL1802457)
Affinity DataIC50: >6.67E+5nM. Assay description: Inhibition of PRMT1-mediated methylation of NPL3 after 90 mins by scintillation counting in presence of S-adenosyl-l-[methyl-3H]methionine
In DepthDetails ArticlePubMed