BDBM50347774 CHEMBL1802856
SMILES CN1C(NC(C)=O)=N\C(=C/c2ccc3OCOc3c2)C1=O
InChI Key InChIKey=ALNRNLPKRKHAJQ-YHYXMXQVSA-N
Data  6 IC50
  Tab Delimited (TSV)   2D SDfile   Computed 3D by Vconf -m prep SDfile
Find this compound or compounds like it in BindingDB:
Activity Spreadsheet -- Enzyme Inhibition Constant Data from BindingDB
Found 6 hits for monomerid = 50347774
TargetDual specificity protein kinase CLK1(Mus musculus)
Universite£? De Rennes 1
Curated by ChEMBL
LigandPNGBDBM50347774(CHEMBL1802856)
Affinity DataIC50:  2.40E+3nM. Assay description: Inhibition of mouse recombinant GST-tagged CLK1 using GRSRSRSRSRSR as substrate
In DepthDetails ArticlePubMed
TargetDual specificity protein kinase CLK3(Mus musculus)
Universite£? De Rennes 1
Curated by ChEMBL
LigandPNGBDBM50347774(CHEMBL1802856)
Affinity DataIC50: >1.00E+4nM. Assay description: Inhibition of mouse recombinant GST-tagged CLK3 using GRSRSRSRSRSR as substrate
In DepthDetails ArticlePubMed
TargetCyclin-dependent kinase 5 activator 1(Homo sapiens (Human))
Universite£? De Rennes 1
Curated by ChEMBL
LigandPNGBDBM50347774(CHEMBL1802856)
Affinity DataIC50: >1.00E+4nM. Assay description: Inhibition of human recombinant CDK5/p25
In DepthDetails ArticlePubMed
TargetDual specificity tyrosine-phosphorylation-regulated kinase 1A(RAT)
Universite£? De Rennes 1
Curated by ChEMBL
LigandPNGBDBM50347774(CHEMBL1802856)
Affinity DataIC50:  3.10E+3nM. Assay description: Inhibition of rat recombinant GST-tagged DYRK1A using KKISGRLSPIMTEQ as substrate and [gamma32]-ATP after 30 mins by scintillation counting
In DepthDetails ArticlePubMed
TargetDual specificity tyrosine-phosphorylation-regulated kinase 2(Homo sapiens (Human))
Universite£? De Rennes 1
Curated by ChEMBL
LigandPNGBDBM50347774(CHEMBL1802856)
Affinity DataIC50:  5.10E+3nM. Assay description: Inhibition of human recombinant GST-tagged DYRK2 using KKISGRLSPIMTEQ as substrate and [gamma32]-ATP after 30 mins by scintillation counting
In DepthDetails ArticlePubMed
TargetSerine/threonine-protein kinase pim-1(Homo sapiens (Human))
Universite£? De Rennes 1
Curated by ChEMBL
LigandPNGBDBM50347774(CHEMBL1802856)
Affinity DataIC50: >1.00E+4nM. Assay description: Inhibition of human recombinant Pim1
In DepthDetails ArticlePubMed