BDBM50347793 CHEMBL1802966
SMILES Nc1ncc(I)c(n1)-c1c[nH]c2cc(Br)ccc12
InChI Key InChIKey=JMIZTNPQJJRDDG-UHFFFAOYSA-N
Data  3 IC50
  Tab Delimited (TSV)   2D SDfile   Computed 3D by Vconf -m prep SDfile
Find this compound or compounds like it in BindingDB:
Activity Spreadsheet -- Enzyme Inhibition Constant Data from BindingDB
Found 3 hits for monomerid = 50347793
TargetDual specificity protein kinase CLK1(Homo sapiens (Human))
Clermont Universite£
Curated by ChEMBL
LigandPNGBDBM50347793(CHEMBL1802966)
Affinity DataIC50:  32nM. Assay description: Inhibition of human recombinant GST-tagged CLK1 using GRSRSRSRSRSR as substrate
In DepthDetails ArticlePubMed
TargetCyclin-dependent kinase 5 activator 1(Homo sapiens (Human))
Clermont Universite£
Curated by ChEMBL
LigandPNGBDBM50347793(CHEMBL1802966)
Affinity DataIC50:  680nM. Assay description: Inhibition of human recombinant CDK5/p25 using Histone H1 and [gamma32]-ATP after 30 mins by scintillation counting
In DepthDetails ArticlePubMed
LigandPNGBDBM50347793(CHEMBL1802966)
Affinity DataIC50:  34nM. Assay description: Inhibition of rat recombinant GST-tagged DYRK1A using myelin protein as substrate and [gamma32]-ATP after 30 mins by scintillation counting
In DepthDetails ArticlePubMed