BDBM50348343 CHEMBL1800314
SMILES COc1cc(\C=N\NC(=O)CSc2ccncn2)cc(OC)c1OC
InChI Key InChIKey=CSPIXKAHLZIHDK-UFWORHAWSA-N
Data  1 IC50
  Tab Delimited (TSV)   2D SDfile   Computed 3D by Vconf -m prep SDfile
Find this compound or compounds like it in BindingDB:
Activity Spreadsheet -- Enzyme Inhibition Constant Data from BindingDB
Found 1 hit for monomerid = 50348343
LigandPNGBDBM50348343(CHEMBL1800314)
Affinity DataIC50:  1.07E+3nM. Assay description: Inhibition of mouse PDE10A assessed as inhibition of hydrolysis of [3H]cGMP to [3H]GMP after 20 mins by scintillation counting
In DepthDetails ArticlePubMed