BDBM50348513 CHEMBL1801273
SMILES CN1CC2(C1)CNC(=O)c1c3Cc4cnc(cc4-c3[nH]c21)-c1ccccc1F
InChI Key InChIKey=CGWPHUQUDGTDTM-UHFFFAOYSA-N
Data  2 IC50
  Tab Delimited (TSV)   2D SDfile   Computed 3D by Vconf -m prep SDfile
Find this compound or compounds like it in BindingDB:
Activity Spreadsheet -- Enzyme Inhibition Constant Data from BindingDB
Found 2 hits for monomerid = 50348513
TargetMAP kinase-activated protein kinase 2(Homo sapiens (Human))
Novartis Institutes For Biomedical Research
Curated by ChEMBL
LigandPNGBDBM50348513(CHEMBL1801273)
Affinity DataIC50:  1.00E+4nM. Assay description: Inhibition of MK2 mediated anisomycin-stimulated hsp27 phosphorylation in human THP-1 cells by fluorometric analysisChecked by Author
In DepthDetails ArticlePubMed
TargetMAP kinase-activated protein kinase 2(Homo sapiens (Human))
Novartis Institutes For Biomedical Research
Curated by ChEMBL
LigandPNGBDBM50348513(CHEMBL1801273)
Affinity DataIC50:  230nM. Assay description: Inhibition of human MK2 using biotinyl-AYSRALSRQLSSGVSEIRCOOH as substrate after 45 mins by FRET analysisChecked by Author
In DepthDetails ArticlePubMed