BDBM50348519 CHEMBL1801290
SMILES CN1CC2(C1)CNC(=O)c1c3CCc4cnc(cc4-c3[nH]c21)-c1ccc(OCCN2CCOCC2)cc1
InChI Key InChIKey=KHZSCWAZHGMNRI-UHFFFAOYSA-N
Data  1 IC50
  Tab Delimited (TSV)   2D SDfile   Computed 3D by Vconf -m prep SDfile
Find this compound or compounds like it in BindingDB:
Activity Spreadsheet -- Enzyme Inhibition Constant Data from BindingDB
Found 1 hit for monomerid = 50348519
TargetMAP kinase-activated protein kinase 2(Homo sapiens (Human))
Novartis Institutes For Biomedical Research
Curated by ChEMBL
LigandPNGBDBM50348519(CHEMBL1801290)
Affinity DataIC50:  1.20E+3nM. Assay description: Inhibition of MK2 mediated anisomycin-stimulated hsp27 phosphorylation in human THP-1 cells by fluorometric analysisChecked by Author
In DepthDetails ArticlePubMed