BDBM50349088 CHEMBL1808001
SMILES COc1cc(cc(OC)c1OC)C(=O)c1coc2c1C(=O)C(=O)C(Br)=C2Br
InChI Key InChIKey=JITLONKQFVPMAK-UHFFFAOYSA-N
Data  2 IC50
  Tab Delimited (TSV)   2D SDfile   Computed 3D by Vconf -m prep SDfile
Find this compound or compounds like it in BindingDB:
Activity Spreadsheet -- Enzyme Inhibition Constant Data from BindingDB
Found 2 hits for monomerid = 50349088
TargetPeptide deformylase(Escherichia coli)
Memorial Sloan-Kettering Cancer Center
Curated by ChEMBL
LigandPNGBDBM50349088(CHEMBL1808001)
Affinity DataIC50: >1.00E+5nM. Assay description: Inhibition of Escherichia coli peptide deformylase after 1 hr by fluorescence polarization based competition assay
In DepthDetails ArticlePubMed
TargetPeptide deformylase, mitochondrial(Homo sapiens (Human))
Memorial Sloan-Kettering Cancer Center
Curated by ChEMBL
LigandPNGBDBM50349088(CHEMBL1808001)
Affinity DataIC50:  5.20E+3nM. Assay description: Inhibition of human peptide deformylase after 1 hr by fluorescence polarization based competition assay
In DepthDetails ArticlePubMed