BDBM50349374 CHEMBL1809264
SMILES CC(C)Cc1nc2ccc(OCC(N)=O)cc2c(-c2cccc(C)c2)c1CN
InChI Key InChIKey=BYBQMJXVOCMKNT-UHFFFAOYSA-N
Data  1 IC50
  Tab Delimited (TSV)   2D SDfile   Computed 3D by Vconf -m prep SDfile
Find this compound or compounds like it in BindingDB:
Activity Spreadsheet -- Enzyme Inhibition Constant Data from BindingDB
Found 1 hit for monomerid = 50349374
TargetDipeptidyl peptidase 4(Homo sapiens (Human))
Takeda Pharmaceutical
Curated by ChEMBL
LigandPNGBDBM50349374(CHEMBL1809264)
Affinity DataIC50:  57nM. Assay description: Inhibition of human Dipeptidyl peptidase-4 expressed in Caco-2 cells using Gly-Pro-pNA.Tos as substrate after 60 mins by microplate reader analysis
In DepthDetails ArticlePubMed