BDBM50349584 CHEMBL1808913
SMILES [#6]-[#16]-[#6]-[#6]-[#6@H](-[#7]-[#6](=O)-[#6@H](-[#6]-[#6]-[#6]\[#7]=[#6](/[#7])-[#7])-[#7]-[#6](=O)-[#6]-c1ccccc1)-[#6](=O)-[#7]-[#6@@H](-[#6]-[#6]-[#6]\[#7]=[#6](/[#7])-[#7])-[#6](=O)-[#7]-[#6]-c1ccc(cc1)-[#6](-[#7])=[#7]
InChI Key InChIKey=IGNVTEYUMOULHZ-GSDHBNRESA-N
Data  1 KI
  Tab Delimited (TSV)   2D SDfile   Computed 3D by Vconf -m prep SDfile
Find this compound or compounds like it in BindingDB:
Activity Spreadsheet -- Enzyme Inhibition Constant Data from BindingDB
Found 1 hit for monomerid = 50349584
TargetFurin(Homo sapiens (Human))
Philipps University Marburg
Curated by ChEMBL
LigandPNGBDBM50349584(CHEMBL1808913)
Affinity DataKi:  9.70nM. Assay description: Inhibition of recombinant human furin expressed in CHO cells using pyroGlu- Arg-Thr-Lys-Arg-AMC as the substrate after 30 mins
In DepthDetails ArticlePubMed