BDBM50349723 CHEMBL1809150
SMILES CSc1nn(-c2ccccc2)c2cc(ccc12)C1CCNCC1
InChI Key InChIKey=ZULCNSCDKKCPSI-UHFFFAOYSA-N
Data  1 IC50
  Tab Delimited (TSV)   2D SDfile   Computed 3D by Vconf -m prep SDfile
Find this compound or compounds like it in BindingDB:
Activity Spreadsheet -- Enzyme Inhibition Constant Data from BindingDB
Found 1 hit for monomerid = 50349723
TargetKetohexokinase(Homo sapiens (Human))
Johnson & Johnson Pharmaceutical Research And Development
Curated by ChEMBL
LigandPNGBDBM50349723(CHEMBL1809150)
Affinity DataIC50:  330nM. Assay description: Inhibition of KHK-mediated conversion of D-fructose to fructose-1-phosphate after 60 mins by high throughput mass spectrometry analysis
In DepthDetails ArticlePubMed