BDBM50349728 CHEMBL1809155::US8822447, 121::US9771375, Example 121
SMILES CSc1nn(-c2ccccc2)c2cc(OC3CCNCC3)ccc12
InChI Key InChIKey=KJTKWSSZJXVTMQ-UHFFFAOYSA-N
Data  3 IC50
  Tab Delimited (TSV)   2D SDfile   Computed 3D by Vconf -m prep SDfile
Find this compound or compounds like it in BindingDB:
Activity Spreadsheet -- Enzyme Inhibition Constant Data from BindingDB
Found 3 hits for monomerid = 50349728
TargetKetohexokinase(Homo sapiens (Human))
Janssen Pharmaceutica
US Patent
LigandPNGBDBM50349728(CHEMBL1809155 | US8822447, 121 | US9771375, Exampl...)
Affinity DataIC50:  710nMT: 2°C. Assay description: An enzymatic assay was developed to measure KHK-mediated conversion of D-fructose to Fructose-1-P (F-1-P) using High Throughput Mass Spectroscopy (HT...
In DepthDetails US Patent
TargetKetohexokinase(Homo sapiens (Human))
Janssen Pharmaceutica
US Patent
LigandPNGBDBM50349728(CHEMBL1809155 | US8822447, 121 | US9771375, Exampl...)
Affinity DataIC50:  710nM. Assay description: An enzymatic assay was developed to measure KHK-mediated conversion of D-fructose to Fructose-1-P (F-1-P) using High Throughput Mass Spectroscopy (HT...
In DepthDetails US Patent
TargetKetohexokinase(Homo sapiens (Human))
Janssen Pharmaceutica
US Patent
LigandPNGBDBM50349728(CHEMBL1809155 | US8822447, 121 | US9771375, Exampl...)
Affinity DataIC50:  710nM. Assay description: Inhibition of KHK-mediated conversion of D-fructose to fructose-1-phosphate after 60 mins by high throughput mass spectrometry analysis
In DepthDetails ArticlePubMed