BDBM50349754 CHEMBL1809181::US8822447, 55::US9771375, Example 55
SMILES CCN1CCN(CC1)c1ccc2c(CC)nn(-c3ccccc3)c2c1
InChI Key InChIKey=QQRBENGNGFOSIT-UHFFFAOYSA-N
Data  3 IC50
  Tab Delimited (TSV)   2D SDfile   Computed 3D by Vconf -m prep SDfile
Find this compound or compounds like it in BindingDB:
Activity Spreadsheet -- Enzyme Inhibition Constant Data from BindingDB
Found 3 hits for monomerid = 50349754
TargetKetohexokinase(Homo sapiens (Human))
Janssen Pharmaceutica
US Patent
LigandPNGBDBM50349754(CHEMBL1809181 | US8822447, 55 | US9771375, Example...)
Affinity DataIC50:  1.15E+4nMT: 2°C. Assay description: An enzymatic assay was developed to measure KHK-mediated conversion of D-fructose to Fructose-1-P (F-1-P) using High Throughput Mass Spectroscopy (HT...
In DepthDetails US Patent
TargetKetohexokinase(Homo sapiens (Human))
Janssen Pharmaceutica
US Patent
LigandPNGBDBM50349754(CHEMBL1809181 | US8822447, 55 | US9771375, Example...)
Affinity DataIC50:  1.15E+4nM. Assay description: An enzymatic assay was developed to measure KHK-mediated conversion of D-fructose to Fructose-1-P (F-1-P) using High Throughput Mass Spectroscopy (HT...
In DepthDetails US Patent
TargetKetohexokinase(Homo sapiens (Human))
Janssen Pharmaceutica
US Patent
LigandPNGBDBM50349754(CHEMBL1809181 | US8822447, 55 | US9771375, Example...)
Affinity DataIC50:  1.15E+4nM. Assay description: Inhibition of KHK-mediated conversion of D-fructose to fructose-1-phosphate after 60 mins by high throughput mass spectrometry analysis
In DepthDetails ArticlePubMed