BDBM50349763 CHEMBL1809190
SMILES CCc1nc(-c2ccccc2)n2cc(ccc12)N1CCNCC1
InChI Key InChIKey=JTZKJXSPRHRGPU-UHFFFAOYSA-N
Data  1 IC50
  Tab Delimited (TSV)   2D SDfile   Computed 3D by Vconf -m prep SDfile
Find this compound or compounds like it in BindingDB:
Activity Spreadsheet -- Enzyme Inhibition Constant Data from BindingDB
Found 1 hit for monomerid = 50349763
TargetKetohexokinase(Homo sapiens (Human))
Johnson & Johnson Pharmaceutical Research And Development
Curated by ChEMBL
LigandPNGBDBM50349763(CHEMBL1809190)
Affinity DataIC50: >2.00E+4nM. Assay description: Inhibition of KHK-mediated conversion of D-fructose to fructose-1-phosphate after 60 mins by high throughput mass spectrometry analysis
In DepthDetails ArticlePubMed