BDBM50350097 CHEMBL1813884
SMILES Oc1ccc(Cl)cc1C(=O)Nc1ccc(Oc2ccc3ccccc3c2)c(Cl)c1
InChI Key InChIKey=KZWFIRTXBMVQSC-UHFFFAOYSA-N
Data  1 IC50
  Tab Delimited (TSV)   2D SDfile   Computed 3D by Vconf -m prep SDfile
Find this compound or compounds like it in BindingDB:
Activity Spreadsheet -- Enzyme Inhibition Constant Data from BindingDB
Found 1 hit for monomerid = 50350097
TargetPoly(ADP-ribose) glycohydrolase(Homo sapiens (Human))
University Of Arizona
Curated by ChEMBL
LigandPNGBDBM50350097(CHEMBL1813884)
Affinity DataIC50:  1.17E+5nM. Assay description: Inhibition of PARG using [alpha-32P]ADP-ribose polymers after 5 mins by TRAP assay
In DepthDetails ArticlePubMed