BDBM50350172 CHEMBL1814748
SMILES C[C@H]1CN(CCN1C(c1ccc(F)cc1)c1ccc(F)cc1)C(=O)C[C@H](N)C(=O)N1Cc2ccccc2C1
InChI Key InChIKey=VAHNMPYIDDIFGT-DCFHFQCYSA-N
Data  3 IC50
  Tab Delimited (TSV)   2D SDfile   Computed 3D by Vconf -m prep SDfile
Find this compound or compounds like it in BindingDB:
Activity Spreadsheet -- Enzyme Inhibition Constant Data from BindingDB
Found 3 hits for monomerid = 50350172
TargetDipeptidyl peptidase 8(Homo sapiens (Human))
University Of Antwerp (Ua)
Curated by ChEMBL
LigandPNGBDBM50350172(CHEMBL1814748)
Affinity DataIC50:  32nM. Assay description: Inhibition of recombinant human DPP8 assessed as pNA release from Ala-Pro- p-nitroanilide substrate pre-incubated with enzyme for 15 min prior to sub...
In DepthDetails ArticlePubMed
TargetDipeptidyl peptidase 2(Homo sapiens (Human))
University Of Antwerp (Ua)
Curated by ChEMBL
LigandPNGBDBM50350172(CHEMBL1814748)
Affinity DataIC50: >5.00E+4nM. Assay description: Inhibition of human seminal plasma DPP2 assessed as pNA release from Lys-Ala-p-nitroanilide substrate pre-incubated with enzyme for 15 min prior to s...
In DepthDetails ArticlePubMed
TargetDipeptidyl peptidase 4(Homo sapiens (Human))
University Of Antwerp (Ua)
Curated by ChEMBL
LigandPNGBDBM50350172(CHEMBL1814748)
Affinity DataIC50: >1.00E+5nM. Assay description: Inhibition of human seminal plasma DPP4 assessed as pNA release from Gly-Pro-p-nitroanilide substrate pre-incubated with enzyme for 15 min prior to s...
In DepthDetails ArticlePubMed