BDBM50350226 CHEMBL1812013
SMILES COCCOC(=O)c1c(C)oc2cc(OC)c(OCc3oc4cc(OC)c(OS([O-])(=O)=O)cc4c3C(=O)OCCOC)cc12
InChI Key InChIKey=RMNAULNDKZNMOO-UHFFFAOYSA-M
Data  1 IC50
  Tab Delimited (TSV)   2D SDfile   Computed 3D by Vconf -m prep SDfile
Find this compound or compounds like it in BindingDB:
Activity Spreadsheet -- Enzyme Inhibition Constant Data from BindingDB
Found 1 hit for monomerid = 50350226
TargetProthrombin(Homo sapiens (Human))
Virginia Commonwealth University
Curated by ChEMBL
LigandPNGBDBM50350226(CHEMBL1812013)
Affinity DataIC50:  3.75E+5nM. Assay description: Inhibition of human alpha-thrombin assessed as spectrozyme TH hydrolysis after 10 mins by spectrophotometric analysisChecked by Author
In DepthDetails ArticlePubMed