BDBM50350232 CHEMBL1812019
SMILES CCOC(=O)c1c(C)oc2cc(OCc3oc4cc(OC)c(OS([O-])(=O)=O)cc4c3C(=O)OCC)c(OS([O-])(=O)=O)cc12
InChI Key InChIKey=ITXPYBYTVYPQAJ-UHFFFAOYSA-L
Data  1 IC50
  Tab Delimited (TSV)   2D SDfile   Computed 3D by Vconf -m prep SDfile
Find this compound or compounds like it in BindingDB:
Activity Spreadsheet -- Enzyme Inhibition Constant Data from BindingDB
Found 1 hit for monomerid = 50350232
TargetProthrombin(Homo sapiens (Human))
Virginia Commonwealth University
Curated by ChEMBL
LigandPNGBDBM50350232(CHEMBL1812019)
Affinity DataIC50:  7.64E+5nM. Assay description: Inhibition of human alpha-thrombin assessed as spectrozyme TH hydrolysis after 10 mins by spectrophotometric analysisChecked by Author
In DepthDetails ArticlePubMed